Diiodosilane

Gas phase thermochemistry data

Quantity Value Units Method Reference Comment
Δfgas-38.07kJ/molReviewChase, 1998Data last reviewed in December, 1976
Quantity Value Units Method Reference Comment
gas,1 bar326.79J/mol*KReviewChase, 1998Data last reviewed in December, 1976

Gas Phase Heat Capacity (Shomate Equation)

Cp° = A + B*t + C*t2 + D*t3 + E/t2
H° − H°298.15= A*t + B*t2/2 + C*t3/3 + D*t4/4 − E/t + F − H
S° = A*ln(t) + B*t + C*t2/2 + D*t3/3 − E/(2*t2) + G
    Cp = heat capacity (J/mol*K)
    H° = standard enthalpy (kJ/mol)
    S° = standard entropy (J/mol*K)
    t = temperature (K) / 1000.

View plot Requires a JavaScript / HTML 5 canvas capable browser.

View table.

Temperature (K) 298. - 1200.1200. - 6000.
A 57.66891103.1561
B 70.620062.615277
C -41.18671-0.508913
D 9.2505730.034207
E -0.652524-10.16022
F -60.25127-92.45176
G 373.6044419.6343
H -38.07402-38.07402
ReferenceChase, 1998Chase, 1998
Comment Data last reviewed in December, 1976 Data last reviewed in December, 1976

References

Chase, 1998
Chase, M.W., Jr., NIST-JANAF Themochemical Tables, Fourth Edition, J. Phys. Chem. Ref. Data, Monograph 9, 1998, 1-1951. [all data]