2-Propenethioamide, 2-cyano-3-(3-methoxyphenyl)-

Reaction thermochemistry data

Data compiled by: Hussein Y. Afeefy, Joel F. Liebman, and Stephen E. Stein

Individual Reactions

C22H20N4O2S2 = 22-Propenethioamide, 2-cyano-3-(3-methoxyphenyl)-

By formula: C22H20N4O2S2 = 2C11H10N2OS

Quantity Value Units Method Reference Comment
Δr-64.0kJ/molEqkBrunskill, De, et al., 1980liquid phase; solvent: DMSO

References

Brunskill, De, et al., 1980
Brunskill, J.S.A.; De, A.; Ewing, D.F., Substituent effects on reversible cycloaddition reaction, J. Chem. Soc. Perkin Trans. 2, 1980, 4-7. [all data]