3,4,5,6-tetrathiaoctane

Kovats' RI, non-polar column, isothermal

Data compiled by: NIST Mass Spectrometry Data Center, William E. Wallace, director

Column type CapillaryPacked
Active phase OV-101Apiezon M
Column length (m) 50.2.1
Carrier gas HeHe or N2
Substrate  Chromosorb W, AW-DMCS
Column diameter (mm) 0.32
Phase thickness (μm)
Temperature (C) 130.130.
I 1365.1394.
ReferenceMisharina and Golovnya, 1989Garbuzov, Misharina, et al., 1985
Comment MSDC-RI MSDC-RI

References

Misharina and Golovnya, 1989
Misharina, T.A.; Golovnya, R.V., Regularities of retention of a pseudohomologous series of dialkylpolysulfides in capillary gas chromatography, Zh. Anal. Khim., 1989, 44, 514-519. [all data]

Garbuzov, Misharina, et al., 1985
Garbuzov, V.G.; Misharina, T.A.; Aerov, A.F.; Golovnya, R.V., Gas chromatographic retention indices for sulphur(II)-containing organic substances, J. Anal. Chem. USSR (Engl. Transl.), 1985, 40, 4, 576-586. [all data]