Thiophosphoryl difluoride monobromide

Gas phase ion energetics data

Data compiled by: Sharon G. Lias, Rhoda D. Levin, and Sherif A. Kafafi

Ionization energy determinations

IE (eV) Method Reference Comment
10.58PEElbel and Dieck, 1976Vertical value

References

Elbel and Dieck, 1976
Elbel, S.; Dieck, H.t., Photoelectron spectra of group 5 compounds. Part V. Phosphorus halides, R2P(X)Y and RP(X)Y2(R = Me or F; X = O, S, or Se; Y = Cl or Br), J. Chem. Soc. Dalton Trans., 1976, 1762. [all data]