Trichloroboroxin

Gas phase thermochemistry data

Quantity Value Units Method Reference Comment
Δfgas-1631.76kJ/molReviewChase, 1998Data last reviewed in March, 1965
Quantity Value Units Method Reference Comment
gas,1 bar382.36J/mol*KReviewChase, 1998Data last reviewed in March, 1965

Gas Phase Heat Capacity (Shomate Equation)

Cp° = A + B*t + C*t2 + D*t3 + E/t2
H° − H°298.15= A*t + B*t2/2 + C*t3/3 + D*t4/4 − E/t + F − H
S° = A*ln(t) + B*t + C*t2/2 + D*t3/3 − E/(2*t2) + G
    Cp = heat capacity (J/mol*K)
    H° = standard enthalpy (kJ/mol)
    S° = standard entropy (J/mol*K)
    t = temperature (K) / 1000.

View plot Requires a JavaScript / HTML 5 canvas capable browser.

View table.

Temperature (K) 298. - 1100.1100. - 6000.
A 71.92129206.0461
B 311.12391.013035
C -275.5181-0.204853
D 87.528860.014176
E -0.981382-12.79601
F -1668.069-1728.841
G 382.5891578.3125
H -1631.760-1631.760
ReferenceChase, 1998Chase, 1998
Comment Data last reviewed in March, 1965 Data last reviewed in March, 1965

References

Chase, 1998
Chase, M.W., Jr., NIST-JANAF Themochemical Tables, Fourth Edition, J. Phys. Chem. Ref. Data, Monograph 9, 1998, 1-1951. [all data]