benzene, 1-(difluoromethoxy)-4-(4-heptylcyclohexyl)-, trans-

Phase change data

Data compiled by: Thermodynamics Research Center, NIST Boulder Laboratories, Chris Muzny director

Quantity Value Units Method Reference Comment
Tfus280.150KN/APavlyuchenko, Fialkov, et al., 1991Uncertainty assigned by TRC = 0.5 K

In addition to the Thermodynamics Research Center (TRC) data available from this site, much more physical and chemical property data is available from the following TRC products:

References

Pavlyuchenko, Fialkov, et al., 1991
Pavlyuchenko, A.I.; Fialkov, Y.A.; Shelyazhenko, S.V.; Yagupolskii, L.I.; Smirnova, N.I.; Grebenkin, M.F., Molecular structure influence on the physicochemical properties of liquid crystals. 4. Polar liquid crystals with ftorinated terminal substitutes, Zh. Fiz. Khim., 1991, 65, 2249. [all data]