C7H6O

Reaction thermochemistry data

Data compiled by: John E. Bartmess

Individual Reactions

C7H5O- + Hydrogen cation = C7H6O

By formula: C7H5O- + H+ = C7H6O

Quantity Value Units Method Reference Comment
Δr1435. ± 11.kJ/molG+TSHu, Hill, et al., 1997gas phase; Calculations imply singlet carbene in anion, triplet in phenol
Quantity Value Units Method Reference Comment
Δr1406. ± 10.kJ/molCIDCHu, Hill, et al., 1997gas phase; Calculations imply singlet carbene in anion, triplet in phenol

References

Hu, Hill, et al., 1997
Hu, J.; Hill, B.T.; Squires, R.R., New Approach to Carbene Chemistry, via Distonic Carbene Ions. A Case of Spin-Forbidden Proton Transfer and Carbene-Biradical Tautomerism, J. Am. Chem. Soc., 1997, 119, 48, 11699, https://doi.org/10.1021/ja9727070 . [all data]