2,3-Pyrazinedicarbonitrile

Phase change data

Data compiled by: William E. Acree, Jr., James S. Chickos

Quantity Value Units Method Reference Comment
Δsub89.1 ± 2.7kJ/molCMiranda, Morais, et al., 2006

Enthalpy of fusion

ΔfusH (kJ/mol) Temperature (K) Method Reference
19.8405.1DSCMiranda, Morais, et al., 2006

References

Miranda, Morais, et al., 2006
Miranda, Margarida S.; Morais, Victor M.F.; Matos, M. Agostinha R., Thermochemical study of cyanopyrazines: Experimental and theoretical approaches, The Journal of Chemical Thermodynamics, 2006, 38, 5, 559-564, https://doi.org/10.1016/j.jct.2005.07.006 . [all data]