chlorosilane

Gas phase ion energetics data

Data compiled by: Sharon G. Lias, Rhoda D. Levin, and Sherif A. Kafafi

Ionization energy determinations

IE (eV) Method Reference Comment
11.65PEFrost, Herring, et al., 1971Vertical value
11.61 ± 0.02PECradock and Whiteford, 1971Vertical value
11.61 ± 0.05PECradock and Ebsworth, 1971Vertical value

Vibrational and/or electronic energy levels

Data compiled by: Takehiko Shimanouchi

Symmetry:   C     Symmetry Number σ = 3

 Sym.   No   Approximate   Selected Freq.  Infrared   Raman   Comments
 Species   type of mode   Value   Rating   Value  Phase  Value  Phase

a1 1 SiH3 s-str 2201  D 2201 gas OV4)
a1 2 SiH3 s-deform 949  D 949 gas OV5)
a1 3 SiCl str 551  C 551 S gas
e 4 SiH3 d-str 2195  B 2195 S gas
e 5 SiH3 d-deform 954  B 954.4 S gas
e 6 SiH3 rock 664  B 664.0 M gas

Source: Shimanouchi, 1972

References

Frost, Herring, et al., 1971
Frost, D.C.; Herring, F.G.; Katrib, A.; McLean, R.A.N.; Drake, J.E.; Westwood, N.P.C., Photoelectron spectra and bonding in some halosilanes, Can. J. Chem., 1971, 49, 4033. [all data]

Cradock and Whiteford, 1971
Cradock, S.; Whiteford, R.A., Photo-electron spectra of the mono and dihalo silanes and germanes, J. Chem. Soc. Faraday Trans., 1971, 67, 3425. [all data]

Cradock and Ebsworth, 1971
Cradock, S.; Ebsworth, E.A.V., Photo-electron spectra of silyl and germyl halides (p→d)π-bonding, Chem. Commun., 1971, 57. [all data]