Silane, bromo-

Gas phase ion energetics data

Data compiled by: Sharon G. Lias, Rhoda D. Levin, and Sherif A. Kafafi

Ionization energy determinations

IE (eV) Method Reference Comment
11.03SCausley, Clark, et al., 1976
10.90PEFrost, Herring, et al., 1971Vertical value
10.96 ± 0.02PECradock and Whiteford, 1971Vertical value
11.03 ± 0.05PECradock and Ebsworth, 1971Vertical value

Gas phase thermochemistry data

Quantity Value Units Method Reference Comment
Δfgas-18.70kcal/molReviewChase, 1998Data last reviewed in December, 1976
Quantity Value Units Method Reference Comment
gas,1 bar62.729cal/mol*KReviewChase, 1998Data last reviewed in December, 1976

Gas Phase Heat Capacity (Shomate Equation)

Cp° = A + B*t + C*t2 + D*t3 + E/t2
H° − H°298.15= A*t + B*t2/2 + C*t3/3 + D*t4/4 − E/t + F − H
S° = A*ln(t) + B*t + C*t2/2 + D*t3/3 − E/(2*t2) + G
    Cp = heat capacity (cal/mol*K)
    H° = standard enthalpy (kcal/mol)
    S° = standard entropy (cal/mol*K)
    t = temperature (K) / 1000.

View plot Requires a JavaScript / HTML 5 canvas capable browser.

View table.

Temperature (K) 298. - 1200.1200. - 6000.
A 7.05039024.07421
B 26.517210.933575
C -15.48140-0.181751
D 3.4542000.012221
E -0.092437-3.594391
F -22.16120-34.11759
G 63.4935080.83960
H -18.70010-18.70010
ReferenceChase, 1998Chase, 1998
Comment Data last reviewed in December, 1976 Data last reviewed in December, 1976

Vibrational and/or electronic energy levels

Data compiled by: Takehiko Shimanouchi

Symmetry:   C     Symmetry Number σ = 3

 Sym.   No   Approximate   Selected Freq.  Infrared   Raman   Comments
 Species   type of mode   Value   Rating   Value  Phase  Value  Phase

a1 1 SiH3 s-str 2200  D 2200 gas OV4)
a1 2 SiH3 s-deform 930  C 930 S gas
a1 3 SiBr str 430  C 430 M gas
e 4 SiH3 d-str 2196  C 2196 S gas
e 5 SiH3 d-deform 950  B 950.4 S gas
e 6 SiH3 rock 633  B 632.6 S gas

Source: Shimanouchi, 1972

References

Causley, Clark, et al., 1976
Causley, G.C.; Clark, J.B.; Russell, B.R., The vacuum ultraviolet spectrum of bromosilane, Chem. Phys. Lett., 1976, 38, 602. [all data]

Frost, Herring, et al., 1971
Frost, D.C.; Herring, F.G.; Katrib, A.; McLean, R.A.N.; Drake, J.E.; Westwood, N.P.C., Photoelectron spectra and bonding in some halosilanes, Can. J. Chem., 1971, 49, 4033. [all data]

Cradock and Whiteford, 1971
Cradock, S.; Whiteford, R.A., Photo-electron spectra of the mono and dihalo silanes and germanes, J. Chem. Soc. Faraday Trans., 1971, 67, 3425. [all data]

Cradock and Ebsworth, 1971
Cradock, S.; Ebsworth, E.A.V., Photo-electron spectra of silyl and germyl halides (p→d)π-bonding, Chem. Commun., 1971, 57. [all data]