gallium triiodide

Reaction thermochemistry data

Data compiled by: José A. Martinho Simões

Individual Reactions

Gallium trimethyl (l) + 3Iodine (cr) = GaI3 (cr) + 3Methane, iodo- (l)

By formula: C3H9Ga (l) + 3I2 (cr) = GaI3 (cr) + 3CH3I (l)

Quantity Value Units Method Reference Comment
Δr-200.0 ± 8.4kJ/molRSCFowell and Mortimer, 1958Please also see Pedley and Rylance, 1977 and Cox and Pilcher, 1970.

Phase change data

Data compiled by: William E. Acree, Jr., James S. Chickos

Quantity Value Units Method Reference Comment
Δsub100.5 ± 2.0kJ/molTEBrunetti, Piacente, et al., 2010Based on data from 345. - 401. K.

References

Fowell and Mortimer, 1958
Fowell, P.A.; Mortimer, C.T., J. Chem. Soc., 1958, 3734.. [all data]

Pedley and Rylance, 1977
Pedley, J.B.; Rylance, J., Computer Analysed Thermochemical Data: Organic and Organometallic Compounds, University of Sussex, Brigton, 1977. [all data]

Cox and Pilcher, 1970
Cox, J.D.; Pilcher, G., Thermochemistry of Organic and Organometallic Compounds in Academic Press, New York, 1970. [all data]