2,4,7,9-Tetranitro-2,4,7,9-tetraazadecane

Phase change data

Data compiled by: William E. Acree, Jr., James S. Chickos

Enthalpy of fusion

ΔfusH (kJ/mol) Temperature (K) Method Reference
68.09488.1DSCZeman, 1997

References

Zeman, 1997
Zeman, Svatopluk, Some predictions in the field of the physical thermal stability of nitramines, Thermochimica Acta, 1997, 302, 1-2, 11-16, https://doi.org/10.1016/S0040-6031(96)03101-2 . [all data]