1-Propanethiol, 3-trimethylsilyl-

Gas phase ion energetics data

Data compiled by: Sharon G. Lias, John E. Bartmess, Joel F. Liebman, John L. Holmes, Rhoda D. Levin, and W. Gary Mallard

Ionization energy determinations

IE (eV) Method Reference Comment
9.05PEErmakov, Kirichenko, et al., 1987
9.05PEErmakov, Kirichenko, et al., 1987Vertical value

References

Ermakov, Kirichenko, et al., 1987
Ermakov, A.I.; Kirichenko, E.A.; Makrushin, N.A.; Viasova, N.N.; Maroshina, M.Y.; Voronkov, M.G., Electronic spectra and electronic structure of trialkoxysilylalkanethiols, J. Struct. Chem., 1987, 28, 46. [all data]