2,11-dimethyldodecane

Phase change data

Data compiled by: Thermodynamics Research Center, NIST Boulder Laboratories, Chris Muzny director

Quantity Value Units Method Reference Comment
Tfus264.7KN/ALanda and Kejvan, 1931Uncertainty assigned by TRC = 2. K

In addition to the Thermodynamics Research Center (TRC) data available from this site, much more physical and chemical property data is available from the following TRC products:

References

Landa and Kejvan, 1931
Landa, S.; Kejvan, A., Synthesis of 2,11-dimethyldodecane and 2,19-dimethyleicosane, Collect. Czech. Chem. Commun., 1931, 3, 367-76. [all data]