1-Naphthalenol, 2-nitroso-

Condensed phase thermochemistry data

Data compiled by: Hussein Y. Afeefy, Joel F. Liebman, and Stephen E. Stein

Quantity Value Units Method Reference Comment
Δcsolid-4873.6 ± 2.3kJ/molCcbHamilton and Fagley, 1968see Hamilton, 1964
Δcsolid-4884.4kJ/molCcbSwietoslawski and Starczedska, 1925

References

Hamilton and Fagley, 1968
Hamilton, J.V.; Fagley, T.F., Thermochemical study of the structures of 1,2-, 2,1-, and 4,1-nitrosonaphthols, J. Chem. Eng. Data, 1968, 13, 523-527. [all data]

Hamilton, 1964
Hamilton, J.V., A thermochemical study of the structures of 1,2-, 2,1- and 4,1-nitrosonaphthols, Dissertation Abstract, 1964, 3113. [all data]

Swietoslawski and Starczedska, 1925
Swietoslawski, W.; Starczedska, H., Correction des donnees thermochimiques de M.A. Valeur, J. Chem. Phys., 1925, 22, 399-401. [all data]