Bicyclo[2.2.1]heptan-2-one, 3,3-dimethyl-

Normal alkane RI, non-polar column, custom temperature program

Data compiled by: NIST Mass Spectrometry Data Center, William E. Wallace, director

Column type CapillaryCapillaryCapillaryCapillary
Active phase DB-1SLB-5 MSSLB-5 MSDB-5
Column length (m) 30.30.30.
Carrier gas HydrogenHeliumHelium
Substrate
Column diameter (mm) 0.250.250.25
Phase thickness (μm) 0.250.250.25
Program 45 0C 3 0C/min -> 175 0C 15 0C/min -> 300 0C (10 min)50 0C 3 0C/min -> 250 0C (1 min) 10 0C/min -> 300 0C (5 min)not specifiednot specified
I 1036.1084.1078.1083.
ReferenceAlbano, Lima, et al., 2012Costa, De Fina, et al., 2008Costa, De Fina, et al., 2008Isidorov, Zenkevich, et al., 1997
Comment MSDC-RI MSDC-RI MSDC-RI MSDC-RI

Kovats' RI, non-polar column, temperature ramp

Data compiled by: NIST Mass Spectrometry Data Center, William E. Wallace, director

Column type CapillaryCapillary
Active phase DB-5Methyl Silicone
Column length (m) 30.30.
Carrier gas HeHe
Substrate
Column diameter (mm) 0.260.32
Phase thickness (μm) 0.250.25
Tstart (C) 60.60.
Tend (C) 246.250.
Heat rate (K/min) 3.2.
Initial hold (min)  2.
Final hold (min)  5.
I 1083.1085.
ReferenceAdams, 2000Adegoke, Rao, et al., 1998
Comment MSDC-RI MSDC-RI

Gas phase ion energetics data

Data compiled as indicated in comments:
LLK - Sharon G. Lias, Rhoda D. Levin, and Sherif A. Kafafi

Ionization energy determinations

IE (eV) Method Reference Comment
8.6PEFrost, Westwood, et al., 1980LLK
8.89PEFrost, Westwood, et al., 1980Vertical value; LLK

References

Albano, Lima, et al., 2012
Albano, S.M.; Lima, A.S.; Miguel, M.G.; Pedro, L.G.; Barroso, J.G.; Figueiredo, A.C., Antioxidant, anti-5-lipoxygenase and antiacetylcholinesterase activities of essential oils and decoction water of some aromatic plants, Rec. Nat. Prod., 2012, 6, 1, 35-48. [all data]

Costa, De Fina, et al., 2008
Costa, R.; De Fina, M.R.; Valentino, M.R.; Rustaiyan, A.; Dugo, P.; Dugo, G.; Mondello, L., An investigation on the volatile composition of some Artemisia species from Iran, Flavour Fragr. J., 2008, 24, 2, 75-82, https://doi.org/10.1002/ffj.1919 . [all data]

Isidorov, Zenkevich, et al., 1997
Isidorov, V.; Zenkevich, I.; Sacharevich, T., Calculation of Gas Chromatographic Retention Indices for Monoterpenes and Terpenoids from Their Physico-Chemical Constants, Chem. Anal. (Warsaw), 1997, 42, 627-634. [all data]