dimethyl [S(R*,R*)]-tartrate

Condensed phase thermochemistry data

Data compiled by: Hussein Y. Afeefy, Joel F. Liebman, and Stephen E. Stein

Quantity Value Units Method Reference Comment
Δcsolid-619.8kcal/molCcbDunken and Wolf, 1938Corresponding Δfsolid = -286.1 kcal/mol (simple calculation by NIST; no Washburn corrections)

References

Dunken and Wolf, 1938
Dunken, H.; Wolf, K.L., Uber Verbrennungswarmen und innermolekulare Ordnungszustande, Z. Phys. Chem., 1938, 38, 441-450. [all data]