Methanone, bis(2-hydroxy-4-methoxyphenyl)-

Phase change data

Data compiled by: William E. Acree, Jr., James S. Chickos

Enthalpy of vaporization

ΔvapH (kJ/mol) Temperature (K) Method Reference Comment
77.4423.A,UVStephenson and Malanowski, 1987Based on data from 406. - 497. K. See also Schmitt and Hirt, 1960.

Enthalpy of fusion

ΔfusH (kJ/mol) Temperature (K) Method Reference
33.2412.3DSCPrice and Hawkins, 1999

References

Stephenson and Malanowski, 1987
Stephenson, Richard M.; Malanowski, Stanislaw, Handbook of the Thermodynamics of Organic Compounds, 1987, https://doi.org/10.1007/978-94-009-3173-2 . [all data]

Schmitt and Hirt, 1960
Schmitt, Richard G.; Hirt, Robert C., Investigation of the protective ultraviolet absorbers in a space environment. I. Rate of evaporation and vapor pressure studies, J. Polym. Sci., 1960, 45, 145, 35-47, https://doi.org/10.1002/pol.1960.1204514504 . [all data]

Price and Hawkins, 1999
Price, Duncan M.; Hawkins, Michael, Vapour pressures of hydroxybenzophenone UV absorbers, Thermochimica Acta, 1999, 329, 1, 73-76, https://doi.org/10.1016/S0040-6031(99)00005-2 . [all data]