MDE

Normal alkane RI, non-polar column, temperature ramp

View large format table.

Column type Active phase I Reference Comment
CapillaryPolymethylsiloxane, (PMS-20000)1585.Gambaro, Saligari, et al., 199712. m/0.20 mm/0.33 μm, He, 10. K/min; Tstart: 160. C; Tend: 300. C

Normal alkane RI, non-polar column, custom temperature program

View large format table.

Column type Active phase I Reference Comment
CapillaryPolymethylsiloxane, (PMS-20000)1583.Gambaro, Saligari, et al., 199712. m/0.20 mm/0.33 μm, He; Program: not specified
CapillaryPolymethylsiloxane, (PMS-20000)1583.Gambaro, Saligari, et al., 199712. m/0.20 mm/0.33 μm, He; Program: not specified

References

Gambaro, Saligari, et al., 1997
Gambaro, V.; Saligari, E.; Froldi, R.; Bianchi, L., Analysis of street drugs by means of HRGC, Bollettino Chimico Farmaceutica, 1997, 36, 4, 359-367. [all data]