4'-Methyl-a-pyrrolidinopropiophenone

Kovats' RI, non-polar column, temperature ramp

View large format table.

Column type Active phase I Reference Comment
CapillaryHP-11725.Springer, Fritschi, et al., 200312. m/0.20 mm/0.33 μm, He, 100. C @ 3. min, 30. K/min, 310. C @ 8. min
CapillaryCross-Linked Methylsilicone1725.Springer, Peters, et al., 200212. m/0.2 mm/0.33 μm, He, 100. C @ 3. min, 30. K/min, 310. C @ 8. min

References

Springer, Fritschi, et al., 2003
Springer, D.; Fritschi, G.; Maurer, H.H., Metabolism of the new designer drug α-pyrrolidinopropiophenone (PPP) and the toxicological detection of PPP and 4'-methyl-α-pyrrolidinopropiophenone (MPPP) studied in rat urine using gas chromatography-mass spectrometry, J. Chromatogr. B, 2003, 796, 2, 253-266, https://doi.org/10.1016/j.jchromb.2003.07.008 . [all data]

Springer, Peters, et al., 2002
Springer, D.; Peters, F.T.; Fritschi, G.; Maurer, H.H., Studies on the metabolism and toxicological detection of the new designer drug 4'-methyl-α-pyrrolidinopropiophenone in urine using gas chromatography-mass spectrometry, J. Chromatogr. B, 2002, 773, 1, 25-33, https://doi.org/10.1016/S1570-0232(01)00578-5 . [all data]