Ether, isobutyl propenyl, (E)-

Reaction thermochemistry data

Data compiled by: Hussein Y. Afeefy, Joel F. Liebman, and Stephen E. Stein

Individual Reactions

cis-1-Propenyl isobutyl ether = Ether, isobutyl propenyl, (E)-

By formula: C7H14O = C7H14O

Quantity Value Units Method Reference Comment
Δr-1.80 ± 0.23kJ/molEqkOkuyama, Fueno, et al., 1969liquid phase; GC

References

Okuyama, Fueno, et al., 1969
Okuyama, T.; Fueno, T.; Furukawa, J., Structure and reactivity of α,β-unsaturated ethers. 9. Cis-trans isomerization equilibriums in the liquid phase, Tetrahedron, 1969, 25, 5409-5414. [all data]