3-Heptanone, 2-methyl-

Kovats' RI, non-polar column, isothermal

View large format table.

Column type Active phase Temperature (C) I Reference Comment
CapillaryHP-1110.922.Héberger and Görgényi, 199950. m/0.32 mm/1.05 μm, N2
CapillaryHP-150.918.Héberger and Görgényi, 199950. m/0.32 mm/1.05 μm, N2
CapillaryHP-170.919.Héberger and Görgényi, 199950. m/0.32 mm/1.05 μm, N2
CapillaryHP-190.920.Héberger and Görgényi, 199950. m/0.32 mm/1.05 μm, N2

Kovats' RI, polar column, isothermal

View large format table.

Column type Active phase Temperature (C) I Reference Comment
CapillaryHP-Innowax110.1197.5Héberger and Görgényi, 199930. m/0.32 mm/0.5 μm
CapillaryHP-Innowax50.1178.7Héberger and Görgényi, 199930. m/0.32 mm/0.5 μm
CapillaryHP-Innowax70.1185.0Héberger and Görgényi, 199930. m/0.32 mm/0.5 μm
CapillaryHP-Innowax90.1191.0Héberger and Görgényi, 199930. m/0.32 mm/0.5 μm

Van Den Dool and Kratz RI, polar column, temperature ramp

View large format table.

Column type Active phase I Reference Comment
CapillarySupelcowax-101164.Tanchotikul and Hsieh, 198960. m/0.25 mm/0.25 μm, 40. C @ 5. min, 2. K/min, 175. C @ 20. min
CapillarySupelcowax-101170.Tanchotikul and Hsieh, 198960. m/0.25 mm/0.25 μm, 40. C @ 5. min, 2. K/min, 175. C @ 20. min

Normal alkane RI, non-polar column, isothermal

View large format table.

Column type Active phase Temperature (C) I Reference Comment
CapillaryOV-160.918.Amboni, Junkes, et al., 2002

Normal alkane RI, non-polar column, custom temperature program

View large format table.

Column type Active phase I Reference Comment
CapillaryHP-1918.Junkes, Amboni, et al., 2004Program: not specified
CapillaryPolydimethyl siloxane918.Junkes, Castanho, et al., 2003Program: not specified

Normal alkane RI, polar column, custom temperature program

View large format table.

Column type Active phase I Reference Comment
CapillaryInnowax1179.Junkes, Amboni, et al., 2004Program: not specified

Phase change data

Data compiled as indicated in comments:
BS - Robert L. Brown and Stephen E. Stein
TRC - Thermodynamics Research Center, NIST Boulder Laboratories, Chris Muzny director
AC - William E. Acree, Jr., James S. Chickos

Quantity Value Units Method Reference Comment
Tboil431.2KN/AWeast and Grasselli, 1989BS
Tboil429.KN/AWhitmore and Krueger, 1933Uncertainty assigned by TRC = 5. K; TRC
Tboil432.KN/AWallach, 1914Uncertainty assigned by TRC = 3. K; TRC
Tboil433.KN/APickard and Kenyon, 1912Uncertainty assigned by TRC = 3. K; TRC

Enthalpy of vaporization

ΔvapH (kcal/mol) Temperature (K) Method Reference Comment
10.4365.AStephenson and Malanowski, 1987Based on data from 350. - 428. K.; AC

In addition to the Thermodynamics Research Center (TRC) data available from this site, much more physical and chemical property data is available from the following TRC products:

References

Héberger and Görgényi, 1999
Héberger, K.; Görgényi, M., Principal component analysis of Kováts indices for carbonyl compounds in capillary gas chromatography, J. Chromatogr., 1999, 845, 1-2, 21-31, https://doi.org/10.1016/S0021-9673(99)00323-4 . [all data]

Tanchotikul and Hsieh, 1989
Tanchotikul, U.; Hsieh, T.C.-Y., Volatile Flavor Components in Crayfish Waste, J. Food Sci., 1989, 54, 6, 1515-1520, https://doi.org/10.1111/j.1365-2621.1989.tb05149.x . [all data]

Amboni, Junkes, et al., 2002
Amboni, R.D.DeM.C.; Junkes, B. daS.; Yunes, R.A.; Heinzen, V.E.F., Quantitative structure-property relationships study of chromatographic retention indices and normal boiling points for oxo compounds using the semi-empirical topological method, J. Mol. Struct. (Theochem), 2002, 586, 1-3, 71-80, https://doi.org/10.1016/S0166-1280(02)00062-3 . [all data]

Junkes, Amboni, et al., 2004
Junkes, B.S.; Amboni, R.D.M.C.; Yunes, R.A.; Heinzen, V.E.F., Application of the semi-empirical topological index in quantitative structure-chromatographic retention relationship (QSRR) studies of aliphatic ketones and aldehydes on stationary phases of different polarity, J. Braz. Chem. Soc., 2004, 15, 2, 183-189, https://doi.org/10.1590/S0103-50532004000200005 . [all data]

Junkes, Castanho, et al., 2003
Junkes, B.S.; Castanho, R.D.M.; Amboni, C.; Yunes, R.A.; Heinzen, V.E.F., Semiempirical Topological Index: A Novel Molecular Descriptor for Quantitative Structure-Retention Relationship Studies, Internet Electronic Journal of Molecular Design, 2003, 2, 1, 33-49. [all data]