1,2,3-Trithiane, 5,5-dimethyl-

Gas phase ion energetics data

Data compiled by: Sharon G. Lias and Joel F. Liebman

Ionization energy determinations

IE (eV) Method Reference Comment
8.15PEBock, Chenards, et al., 1988Vertical value

References

Bock, Chenards, et al., 1988
Bock, H.; Chenards, B.L.; Rittmeyer, P.; Stein, U., Radical ions, 78 The oxidative desulfuration of organic cyclic polysulfides to disulfide radical cations in AlCl3/H2CCl2 solution, Z. Naturforsch. B:, 1988, 43, 117. [all data]