Tetraspiro[2.0.0.0.2.1.1.1]undecane

Gas phase thermochemistry data

Data compiled by: Hussein Y. Afeefy, Joel F. Liebman, and Stephen E. Stein

Quantity Value Units Method Reference Comment
Δfgas544.0 ± 6.8kJ/molCcbLuk'yanova, Pimenova, et al., 1993

References

Luk'yanova, Pimenova, et al., 1993
Luk'yanova, V.A.; Pimenova, S.M.; Kolesov, V.P.; Kuznetsova, T.S.; Kokoreva, O.V.; Kozhushkov, S.I.; Zefirov, N.S., Enthalpies of formation of some cyclopropane spirohydrocarbons, Russ. J. Phys. Chem. (Engl. Transl.), 1993, 67, 1023-1025, In original 1145. [all data]