Benzoic acid, 2,4,6-trinitro-

Condensed phase thermochemistry data

Data compiled by: Hussein Y. Afeefy, Joel F. Liebman, and Stephen E. Stein

Quantity Value Units Method Reference Comment
Δfsolid-409.7kJ/molCcbMedard and Thomas, 1949Author's hf298_condensed=-101.2 kcal/mol
Quantity Value Units Method Reference Comment
Δcsolid-2773.7kJ/molCcbMedard and Thomas, 1949Author's hf298_condensed=-101.2 kcal/mol

References

Medard and Thomas, 1949
Medard, L.; Thomas, M., Determinations calorimetriques concernant dix-huit derives nitres ou nitrates organiques., Mem. Poudres, 1949, 29, 173-195. [all data]