1,5-Diaminoanthraquinone

Phase change data

Data compiled by: William E. Acree, Jr., James S. Chickos

Enthalpy of sublimation

ΔsubH (kJ/mol) Temperature (K) Reference Comment
118.5 ± 4.8416.Krien, 1984Based on data from 405. - 427. K.

References

Krien, 1984
Krien, G., Thermoanalytische untersuchungen an rauchfarbstoffen, Thermochimica Acta, 1984, 81, 29-43, https://doi.org/10.1016/0040-6031(84)85108-4 . [all data]