Ferrocene, ethyl-

Phase change data

Data compiled by: William E. Acree, Jr., James S. Chickos

Enthalpy of vaporization

ΔvapH (kJ/mol) Temperature (K) Method Reference Comment
65.1 ± 2.7308.MEKaryakin, Kozlova, et al., 2003Based on data from 297. - 320. K.

Enthalpy of fusion

ΔfusH (kJ/mol) Temperature (K) Reference Comment
12.29273.9Kozlova, Karyakin, et al., 2003See also Karyakin, Kozlova, et al., 2003.

References

Karyakin, Kozlova, et al., 2003
Karyakin, N.V.; Kozlova, M.S.; Sheiman, M.S.; Kamelova, G.P.; Larina, V.N., Zh. Fiz. Khim., 2003, 77, 8, 1375. [all data]

Kozlova, Karyakin, et al., 2003
Kozlova, G.P.; Karyakin, N.V.; Sheiman, M.S.; Kamelova, G.P.; Larina, V.N.; Smirnov, A.S., Zh. Fiz. Khim., 2003, 77, 1, 30. [all data]