Ferrocene, (hydroxymethyl)-

Phase change data

Data compiled by: William E. Acree, Jr., James S. Chickos

Quantity Value Units Method Reference Comment
Δvap87.0 ± 0.8kJ/molGSEmel'yanenko, Verevkin, et al., 2007Based on data from 353. - 393. K.
Quantity Value Units Method Reference Comment
Δsub102.8 ± 0.5kJ/molGSEmel'yanenko, Verevkin, et al., 2007Based on data from 313. - 320. K.

Enthalpy of fusion

ΔfusH (kJ/mol) Temperature (K) Method Reference
23.82351.4DSCDa«807»browski, Misterkiewicz, et al., 2001

References

Emel'yanenko, Verevkin, et al., 2007
Emel'yanenko, Vladimir N.; Verevkin, Sergey P.; Krol, Olesya V.; Varushchenko, Raisa M.; Chelovskaya, Nelly V., Vapour pressures and enthalpies of vaporization of a series of the ferrocene derivatives, The Journal of Chemical Thermodynamics, 2007, 39, 4, 594-601, https://doi.org/10.1016/j.jct.2006.09.001 . [all data]

Da«807»browski, Misterkiewicz, et al., 2001
Da«807»browski, Marek; Misterkiewicz, Boguslaw; Sporzynski, Andrzej, Solubilities of Substituted Ferrocenes in Organic Solvents, J. Chem. Eng. Data, 2001, 46, 6, 1627-1631, https://doi.org/10.1021/je010197q . [all data]