6-Ethyl-4,5,7,8-tetrathianonane

Van Den Dool and Kratz RI, non-polar column, temperature ramp

Data compiled by: NIST Mass Spectrometry Data Center, William E. Wallace, director

Column type CapillaryCapillary
Active phase HP-1HP-1
Column length (m) 50.50.
Carrier gas HeHe
Substrate
Column diameter (mm) 0.320.32
Phase thickness (μm) 1.051.05
Tstart (C) 40.40.
Tend (C) 260.260.
Heat rate (K/min) 2.2.
Initial hold (min)
Final hold (min)
I 1685.1616.
ReferenceKuo and Ho, 1992Kuo, Chien, et al., 1990
Comment MSDC-RI MSDC-RI

References

Kuo and Ho, 1992
Kuo, M.-C.; Ho, C.-T., Volatile constituents of the solvent extracts of Welsh onions (Allium fistulosum L. variety Maichuon) and scallions (A. fistulosum L. variety caepitosum), J. Agric. Food Chem., 1992, 40, 10, 1906-1910, https://doi.org/10.1021/jf00022a036 . [all data]

Kuo, Chien, et al., 1990
Kuo, M.-C.; Chien, M.; Ho, C.-T., Novel Polysulfides Identified in the Volatile Components from Welsh Onions (Allium fistulosum L. var. maichuon) and Scallions (Allium fistulosum L. var. caespitosum), J. Agric. Food Chem., 1990, 38, 6, 1378-1381, https://doi.org/10.1021/jf00096a017 . [all data]