5,5'-Methylene-bis(2-keto-1,3-dimethyltetrahydro-1,3,5-triazine

Condensed phase thermochemistry data

Data compiled by: Hussein Y. Afeefy, Joel F. Liebman, and Stephen E. Stein

Quantity Value Units Method Reference Comment
Δfsolid-94.26 ± 0.79kcal/molCcbKarpenko, Gutner, et al., 1990
Quantity Value Units Method Reference Comment
Δcsolid-1691.8 ± 0.79kcal/molCcbKarpenko, Gutner, et al., 1990

References

Karpenko, Gutner, et al., 1990
Karpenko, N.A.; Gutner, N.M.; Ryadnenko, V.L.; Timofeeva, V.I., Enthalpy of combustion and formation of some derivative of urea and symmetric triazine, J. Appl. Chem. USSR, 1990, 63, 204-206. [all data]