[2,2'-Bimorphinan]-3,3',6,6'-tetrol, 7,7',8,8'-tetradehydro-4,5:4',5'-diepoxy-17,17'-dimethyl-, (5α,6α)-(5'α,6'α)-

Normal alkane RI, non-polar column, custom temperature program

View large format table.

Column type Active phase I Reference Comment
OtherMethyl Silicone2770.Ardrey and Moffat, 1981Program: not specified

References

Ardrey and Moffat, 1981
Ardrey, R.E.; Moffat, A.C., Gas-liquid chromatographic retention indices of 1318 substances of toxicological interest on SE-30 or OV-1 stationary phase, J. Chromatogr., 1981, 220, 3, 195-252, https://doi.org/10.1016/S0021-9673(00)81925-1 . [all data]