Silane, dichloroethenylmethyl-

Condensed phase thermochemistry data

Data compiled by: Eugene S. Domalski and Elizabeth D. Hearing

Quantity Value Units Method Reference Comment
liquid381.3J/mol*KN/AGeidarov, Dzhafarov, et al., 1971

Constant pressure heat capacity of liquid

Cp,liquid (J/mol*K) Temperature (K) Reference Comment
177.9298.15Geidarov, Dzhafarov, et al., 1971T = 12 to 300 K. Deposited in VINITI, No 2722-71, 25 March 1971.

References

Geidarov, Dzhafarov, et al., 1971
Geidarov, Kh.I.; Dzhafarov, O.I.; Karasharli, K.A.; Kostryukov, V.N., The true heat capacity and the calculated thermodynamic functions of dichloromethylvinylsilane under standard conditions, Russ. J. Phys. Chem., 1971, 45, 906. [all data]