Hexanoic acid, 2-propenyl ester

Van Den Dool and Kratz RI, non-polar column, temperature ramp

Data compiled by: NIST Mass Spectrometry Data Center, William E. Wallace, director

Column type CapillaryCapillaryCapillaryPacked
Active phase ZB-1HP-5MSCP Sil 5 CBSE-30
Column length (m) 60.30.50.
Carrier gas HeHeHe
Substrate    Celite
Column diameter (mm) 0.250.250.32
Phase thickness (μm) 0.250.250.4
Tstart (C) 60.60.60.75.
Tend (C) 280.250.280.228.
Heat rate (K/min) 3.4.3.
Initial hold (min)  2.10.
Final hold (min)  20.60.
I 1061.1080.1062.1062.
ReferenceHerbrand K., Hammerschmidt F.J., et al., 2007Pino, Mesa, et al., 2005Pino and Marbot, 2001van den Dool and Kratz, 1963
Comment MSDC-RI MSDC-RI MSDC-RI MSDC-RI

Kovats' RI, non-polar column, isothermal

Data compiled by: NIST Mass Spectrometry Data Center, William E. Wallace, director

Column type Packed
Active phase SE-30
Column length (m) 3.7
Carrier gas
Substrate Celite 560 silanized
Column diameter (mm)
Phase thickness (μm)
Temperature (C) 150.
I 1056.
ReferenceAllen and Haken, 1970
Comment MSDC-RI

References

Herbrand K., Hammerschmidt F.J., et al., 2007
Herbrand K.; Hammerschmidt F.J.; Brennecke S.; Liebig M.; Losing G.; Schmidt C.O.; Gatfield I.; Krammer G.; Bertram H.J., Identification of allyl esters in garlic cheese, J. Agric. Food Chem., 2007, 55, 19, 7874-7878, https://doi.org/10.1021/jf0713096 . [all data]

Pino, Mesa, et al., 2005
Pino, J.A.; Mesa, J.; Muñoz, Y.; Martí, M.P.; Marbot, R., Volatile components from mango (Mangifera indica L.) cultivars, J. Agric. Food Chem., 2005, 53, 6, 2213-2223, https://doi.org/10.1021/jf0402633 . [all data]

Pino and Marbot, 2001
Pino, J.A.; Marbot, R., Volatile flavor constituents of acerola (Malpighia emarginata DC.) fruit, J. Agric. Food Chem., 2001, 49, 12, 5880-5882, https://doi.org/10.1021/jf010270g . [all data]

van den Dool and Kratz, 1963
van den Dool, H.; Kratz, P. Dec., A generalization of the retention index system including linear temperature programmed gas-liquid partition chromatography, J. Chromatogr., 1963, 11, 463-471, https://doi.org/10.1016/S0021-9673(01)80947-X . [all data]