CAS Reg. No. 12359-19-2

Reaction thermochemistry data

Data compiled by: John E. Bartmess

Individual Reactions

(CAS Reg. No. 12359-19-2 • 4294967295Phosphorus monoxide) + Phosphorus monoxide = CAS Reg. No. 12359-19-2

By formula: (CAS Reg. No. 12359-19-2 • 4294967295OP) + OP = CAS Reg. No. 12359-19-2

Quantity Value Units Method Reference Comment
Δr692. ± 10.kJ/molN/AN/Agas phase

References

No reference data available.