5-(3,4-Diacetoxy-1-butenynyl)-2,2'-bithienyl

Van Den Dool and Kratz RI, non-polar column, custom temperature program

View large format table.

Column type Active phase I Reference Comment
CapillaryHP-5MS2598.2Andriamaharavo, 201430. m/0.25 mm/0.25 μm, He; Program: 60C (1 min) => 5 C/min => 210C => 10 C/min => 280C (15 min)

Normal alkane RI, non-polar column, temperature ramp

View large format table.

Column type Active phase I Reference Comment
CapillaryHP-5 MS2591.Szarka, Hethelyi, et al., 200830. m/0.25 mm/0.25 μm, Helium, 60. C @ 1. min, 10. K/min, 280. C @ 7. min

References

Andriamaharavo, 2014
Andriamaharavo, N.R., Retention Data. NIST Mass Spectrometry Data Center., NIST Mass Spectrometry Data Center, 2014. [all data]

Szarka, Hethelyi, et al., 2008
Szarka, S.; Hethelyi, E.; Kuzovkina, I.N.; Lemberkovics, E.; Szoke, E., GC-MS method development for the analyses of thiophenes from solvent extracats of Tagetes patula L., Chromatographia Suppl., 2008, 68, S1, s63-s69, https://doi.org/10.1365/s10337-008-0668-5 . [all data]