Ferrocene, (trimethylsilyl)-

Gas phase ion energetics data

Data compiled by: Sharon G. Lias, Rhoda D. Levin, and Sherif A. Kafafi

Ionization energy determinations

IE (eV) Method Reference
9.5 ± 0.10PIAdamchuk, Dmitriev, et al., 1972

References

Adamchuk, Dmitriev, et al., 1972
Adamchuk, V.K.; Dmitriev, A.B.; Prudnikova, G.V.; Sorokin, L.S., Photoionization of low-volatility molecules in a Geiger counter, Opt. Spectrosc., 1972, 33, 191, In original 358. [all data]