(Z)-1-Allyl-2-(prop-1-en-1-yl)disulfane

Normal alkane RI, non-polar column, custom temperature program

Data compiled by: NIST Mass Spectrometry Data Center, William E. Wallace, director

Column type CapillaryCapillaryCapillaryCapillary
Active phase SPB-1DB-5DB-5DB-5
Column length (m) 30.50.50.50.
Carrier gas HeliumHeHeHe
Substrate
Column diameter (mm) 0.320.320.320.32
Phase thickness (μm) 0.250.250.250.25
Program not specified40C (10min) => 3C/min => 95C => 10C/min => 270C (10min)40C (10min) => 3C/min => 95C => 10C/min => 270C (10min)40C (10min) => 3C/min => 95C => 10C/min => 270C (10min)
I 1079.1109.1113.1104.
ReferenceRao, Nagender, et al., 2007Mateo and Zumalacárregui, 1996Mateo and Zumalacárregui, 1996Mateo and Zumalacárregui, 1996
Comment MSDC-RI MSDC-RI MSDC-RI MSDC-RI

Normal alkane RI, non-polar column, temperature ramp

Data compiled by: NIST Mass Spectrometry Data Center, William E. Wallace, director

Column type Capillary
Active phase SPB-1
Column length (m) 30.
Carrier gas Helium
Substrate
Column diameter (mm) 0.32
Phase thickness (μm) 0.25
Tstart (C) 40.
Tend (C) 220.
Heat rate (K/min) 2.
Initial hold (min) 2.
Final hold (min)
I 1068.
ReferenceRao, Nagender, et al., 2007
Comment MSDC-RI

References

Rao, Nagender, et al., 2007
Rao, P.P.; Nagender, A.; Rao, L.J.; Rao, D.G., Studies on the effects of microwave drying and cabinet tray drying on the chemical composition of volatile oils of garlic powders, Eur. Food Res. Technol., 2007, 224, 6, 791-795, https://doi.org/10.1007/s00217-006-0364-3 . [all data]

Mateo and Zumalacárregui, 1996
Mateo, J.; Zumalacárregui, J.M., Volatile compounds in chorizo and their changes during ripening, Meat Sci., 1996, 44, 4, 255-273, https://doi.org/10.1016/S0309-1740(96)00028-9 . [all data]