CAS Reg. No. 12134-48-4

Reaction thermochemistry data

Data compiled by: John E. Bartmess

Individual Reactions

Fluorine anion + CAS Reg. No. 12134-48-4 = (Fluorine anion • CAS Reg. No. 12134-48-4)

By formula: F- + CAS Reg. No. 12134-48-4 = (F- • CAS Reg. No. 12134-48-4)

Quantity Value Units Method Reference Comment
Δr519. ± 50.kJ/molTherPyatenko and Gorokhov, 1984gas phase; value altered from reference due to conversion from electron convention to ion convention

References

Pyatenko and Gorokhov, 1984
Pyatenko, A.T.; Gorokhov, L.N., Electron Affinities of the U2Fn Molecules (8n12), Chem. Phys. Lett., 1984, 105, 2, (1984)}, https://doi.org/10.1016/0009-2614(84)85651-1 . [all data]