2-Iodobenzylidenemalonic acid

Condensed phase thermochemistry data

Data compiled by: Hussein Y. Afeefy, Joel F. Liebman, and Stephen E. Stein

Quantity Value Units Method Reference Comment
Δfsolid-165.1kcal/molCcbZavoianu, Ciocazanu, et al., 1988
Quantity Value Units Method Reference Comment
Δcsolid-974.1kcal/molCcbZavoianu, Ciocazanu, et al., 1988

References

Zavoianu, Ciocazanu, et al., 1988
Zavoianu, D.; Ciocazanu, I.; Moga-Gheorghe, S.; Bornaz, C., Structure and reactivity of acids. Heat of combustion and heat of formation of some benzylidenemalonic acids, Rev. Chim. (Bucharest), 1988, 39, 751-753. [all data]