Cyclopentadienylmanganesedicarbonyltriphenylphosphine

Gas phase ion energetics data

Data compiled by: Henry M. Rosenstock, Keith Draxl, Bruce W. Steiner, and John T. Herron

Ionization energy determinations

IE (eV) Method Reference
6.93 ± 0.05EIMuller and Fenderl, 1969

References

Muller and Fenderl, 1969
Muller, J.; Fenderl, K., Massenspektren und Ionisierungspotentiale von C5H5Mn(CO)2PX3-Komplexen, J. Organometal. Chem., 1969, 19, 123. [all data]