Rhodium 1,5-cyclooctadiene chloride dimer

Gas phase ion energetics data

Data compiled by: Henry M. Rosenstock, Keith Draxl, Bruce W. Steiner, and John T. Herron

Ionization energy determinations

IE (eV) Method Reference
7.1 ± 0.1EIDavidson, Jones, et al., 1969

References

Davidson, Jones, et al., 1969
Davidson, I.M.T.; Jones, M.; Kemmitt, R.D.W., Mass spectra and appearance potentials of some 1,5-cyclooctadiene-rhodium complexes, J.Organometal. Chem., 1969, 17, 169. [all data]