8-Phenyloctylammonium bromide

Phase change data

Data compiled by: Eugene S. Domalski and Elizabeth D. Hearing

Enthalpy of phase transition

ΔHtrs (kJ/mol) Temperature (K) Initial Phase Final Phase Reference Comment
0.690356.crystaline, IIIcrystaline, IIVan Oort and White, 1989
12.100379.crystaline, IIcrystaline, IVan Oort and White, 1989

Entropy of phase transition

ΔStrs (J/mol*K) Temperature (K) Initial Phase Final Phase Reference Comment
0.23356.crystaline, IIIcrystaline, IIVan Oort and White, 1989
3.83379.crystaline, IIcrystaline, IVan Oort and White, 1989

References

Van Oort and White, 1989
Van Oort, M.J.M.; White, M.A., Solid-solid phase transitions in phenalkylammonium salts, Thermochim. Acta, 1989, 139, 205-217. [all data]