4-n-Pentanoyl-4-n'-decanoyloxyazobenzene

Phase change data

Data compiled by: Eugene S. Domalski and Elizabeth D. Hearing

Enthalpy of phase transition

ΔHtrs (kJ/mol) Temperature (K) Initial Phase Final Phase Reference Comment
4.310338.2crystaline, IIcrystaline, IFanelli, Poeti, et al., 1988
28.752368.6crystaline, IliquidFanelli, Poeti, et al., 1988
8.000405.2liquidliquidFanelli, Poeti, et al., 1988
5.406364.7liquidliquidFanelli, Poeti, et al., 1988

Entropy of phase transition

ΔStrs (J/mol*K) Temperature (K) Initial Phase Final Phase Reference Comment
12.74338.2crystaline, IIcrystaline, IFanelli, Poeti, et al., 1988
78.01368.6crystaline, I, Solidliquid, smectic AFanelli, Poeti, et al., 1988
19.74405.2liquid, Smectic Aliquid, isotropicFanelli, Poeti, et al., 1988
14.82364.7liquid, Smectic Aliquid, smectic monotropic 1Fanelli, Poeti, et al., 1988

References

Fanelli, Poeti, et al., 1988
Fanelli, E.; Poeti, G.; Francescangeli, O.; Torguati, G., Mesomorphic behaviour of some 4-n-pentanoyl-4'-n-alkanoyloxy azobenzenes (PPAPE). A new series of liquid-crystal compounds, Il Nuovo Cimento, 1988, 10(11), 1373-1384. [all data]