2,4,6-Trimethylnitrosobenzene

Gas phase thermochemistry data

Data compiled by: Hussein Y. Afeefy, Joel F. Liebman, and Stephen E. Stein

Quantity Value Units Method Reference Comment
Δfgas107.4 ± 1.9kJ/molCmAcree, Tucker, et al., 1993From heat of decomposition of dimer

References

Acree, Tucker, et al., 1993
Acree, W.E., Jr.; Tucker, S.A.; Pilcher, G.; Chowdhary, A.; Ribeiro da Silva, M.D.M.; Monte, M.J.S., Enthalpies of combustion of 2,2',4,4',6,6'-hexamethylazobenzene-N,N-dioxide, 2,2',6,6'-tetramethylazobenzene-N,N-dioxide, 2,4,6-trimethylnitrobenzene, and 2,6-dimethyl-nitrobenzene: the dissociation enthalpies of the N=N and N-O bonds, J. Chem. Thermodyn., 1993, 25, 1253-1261. [all data]