Phthalazin-1-one

Phase change data

Data compiled by: William E. Acree, Jr., James S. Chickos

Quantity Value Units Method Reference Comment
Δsub107.4 ± 0.5kJ/molMERibeiro da Silva and Cabral, 2008Based on data from 348. - 368. K.

Enthalpy of sublimation

ΔsubH (kJ/mol) Temperature (K) Method Reference Comment
104.4 ± 0.5358.MERibeiro da Silva and Cabral, 2008Based on data from 348. - 368. K.

References

Ribeiro da Silva and Cabral, 2008
Ribeiro da Silva, Manuel A.V.; Cabral, Joana I.T.A., Experimental study on the thermochemistry of 1-(2H)-phthalazinone and phthalhydrazide, The Journal of Chemical Thermodynamics, 2008, 40, 5, 829-835, https://doi.org/10.1016/j.jct.2008.01.010 . [all data]