4-Aminothiophenol

Phase change data

Data compiled by: Robert L. Brown and Stephen E. Stein

Quantity Value Units Method Reference Comment
Tfus319.KN/ABuckingham and Donaghy, 1982

Reduced pressure boiling point

Tboil (K) Pressure (bar) Reference
415.70.021Aldrich Chemical Company Inc., 1990
415.0.020Buckingham and Donaghy, 1982

References

Buckingham and Donaghy, 1982
Buckingham, J.; Donaghy, S.M., Dictionary of Organic Compounds: Fifth Edition, Chapman and Hall, New York, 1982, 1. [all data]

Aldrich Chemical Company Inc., 1990
Aldrich Chemical Company Inc., Catalog Handbook of Fine Chemicals, Aldrich Chemical Company, Inc., Milwaukee WI, 1990, 1. [all data]