1H-Pyrrole-2-carboxaldehyde, 1-methyl-

Kovats' RI, polar column, temperature ramp

View large format table.

Column type Active phase I Reference Comment
CapillaryDB-Wax1637.Shimoda and Shibamoto, 1990He, 40. C @ 6. min, 3. K/min; Column length: 60. m; Column diameter: 0.25 mm; Tend: 190. C

Van Den Dool and Kratz RI, non-polar column, temperature ramp

View large format table.

Column type Active phase I Reference Comment
CapillaryBPX-51022.Ames, Guy, et al., 200150. m/0.32 mm/0.25 μm, He, 60. C @ 5. min, 4. K/min, 250. C @ 10. min
CapillaryBPX-51022.Ames, Guy, et al., 200150. m/0.32 mm/0.25 μm, He, 60. C @ 5. min, 4. K/min, 250. C @ 10. min
CapillaryDB-1970.Kim, 200160. m/0.32 mm/1. μm, He, 40. C @ 5. min, 2. K/min; Tend: 220. C
CapillaryHP-1964.Oh, Hartman, et al., 199250. m/0.32 mm/1.05 μm, He, 2. K/min, 260. C @ 10. min; Tstart: 40. C

Van Den Dool and Kratz RI, non-polar column, custom temperature program

View large format table.

Column type Active phase I Reference Comment
CapillaryZB-5991.Lu, Hao, et al., 200530. m/0.25 mm/0.25 μm, He; Program: 50C(1min) => 3C/min => 209C => 20C/min => 280C

Van Den Dool and Kratz RI, polar column, temperature ramp

View large format table.

Column type Active phase I Reference Comment
CapillaryDB-Wax1626.Lopez-Galilea I., Fournier N., et al., 200630. m/0.32 mm/0.5 μm, He, 5. K/min, 240. C @ 10. min; Tstart: 40. C
CapillaryDB-Wax1610.Kim, 200160. m/0.25 mm/0.25 μm, He, 40. C @ 5. min, 2. K/min, 200. C @ 30. min
CapillaryDB-Wax1620.Shiratsuchi, Shimoda, et al., 199460. m/0.25 mm/0.25 μm, 2. K/min, 230. C @ 60. min; Tstart: 50. C
CapillaryDB-Wax1620.Shiratsuchi, Shimoda, et al., 1994, 260. m/0.25 mm/0.25 μm, He, 2. K/min, 230. C @ 60. min; Tstart: 50. C
CapillaryCP-WAX 57CB1618.Salter L.J., Mottram D.S., et al., 198860. C @ 5. min, 4. K/min; Column length: 50. m; Column diameter: 0.32 mm; Tend: 200. C

Normal alkane RI, non-polar column, temperature ramp

View large format table.

Column type Active phase I Reference Comment
CapillarySLB-5MS1020.Risticevic, Carasek, et al., 200810. m/0.18 mm/0.18 μm, Helium, 40. C @ 1.5 min, 10. K/min; Tend: 295. C
CapillaryHP-51010.0Leffingwell and Alford, 200560. m/0.32 mm/0.25 μm, He, 30. C @ 2. min, 2. K/min, 260. C @ 28. min
CapillaryDB-1970.Buttery, Ling, et al., 199730. C @ 25. min, 4. K/min, 200. C @ 20. min; Column length: 60. m; Column diameter: 0.25 mm

Normal alkane RI, non-polar column, custom temperature program

View large format table.

Column type Active phase I Reference Comment
CapillaryPolydimethyl siloxane with 5 % Ph groups1010.Robinson, Adams, et al., 2012Program: not specified
CapillaryPolydimethyl siloxane with 5 % Ph groups1015.Robinson, Adams, et al., 2012Program: not specified
CapillaryDB-5 MS1016.Cajka, Hajslova, et al., 200730. m/0.25 mm/0.25 μm, Helium; Program: 45 0C (0.75 min) 10 0C/min -> 200 0C 30 0C/min -> 245 0C (1.25 min)
CapillarySE-30986.Vinogradov, 2004Program: not specified
CapillaryRSL-150975.Buchbauer, Nikiforov, et al., 199460. m/0.32 mm/0.25 μm, He; Program: 30c (1.5min) => 20C/min => 55C => 6C/min => 200C(10min)

Normal alkane RI, polar column, temperature ramp

View large format table.

Column type Active phase I Reference Comment
CapillaryHP-Innowax1606.Puvipirom and Chaisei, 201215. m/0.32 mm/0.50 μm, Helium, 3. K/min; Tstart: 40. C; Tend: 250. C
CapillaryHP-Innowax1615.Puvipirom and Chaisei, 201215. m/0.32 mm/0.50 μm, Helium, 3. K/min; Tstart: 40. C; Tend: 250. C
CapillaryDB-Wax1651.Moon and Shibamoto, 200960. m/0.25 mm/0.50 μm, Helium, 40. C @ 5. min, 2. K/min, 210. C @ 70. min
CapillaryTC-Wax1632.Ishikawa, Ito, et al., 200460. m/0.25 mm/0.5 μm, He, 40. C @ 8. min, 3. K/min; Tend: 230. C
CapillaryHP-Wax1661.Sanz, Maeztu, et al., 200260. m/0.25 mm/0.5 μm, He, 40. C @ 6. min, 3. K/min; Tend: 190. C
CapillaryHP-Wax1661.Maeztu, Sanz, et al., 200160. m/0.25 mm/0.5 μm, He, 40. C @ 6. min, 3. K/min; Tend: 190. C
CapillaryHP-Wax1661.Sanz, Ansorena, et al., 200160. m/0.25 mm/0.5 μm, He, 40. C @ 6. min, 3. K/min; Tend: 190. C
CapillaryCarbowax 20M1583.Kawakami and Kobayashi, 1991He, 60. C @ 4. min, 2. K/min; Column length: 50. m; Column diameter: 0.25 mm; Tend: 180. C

Normal alkane RI, polar column, custom temperature program

View large format table.

Column type Active phase I Reference Comment
CapillaryDB-Wax1626.Welke, Manfroi, et al., 201230. m/0.25 mm/0.25 μm, Helium; Program: not specified
CapillaryDB-Wax1632.Welke, Manfroi, et al., 201230. m/0.25 mm/0.25 μm, Helium; Program: not specified
CapillaryDB-Wax1607.Gonzalez-Rios, Suarez-Quiroz, et al., 200730. m/0.25 mm/0.25 μm, Hydrogen; Program: 44 0C 3 0C/min -> 170 0C 8 0C/min -> 250 0C
CapillaryDB-Wax1661.Gonzalez-Rios, Suarez-Quiroz, et al., 200730. m/0.25 mm/0.25 μm, Hydrogen; Program: not specified
CapillaryCarbowax 20M1616.Vinogradov, 2004Program: not specified

References

Shimoda and Shibamoto, 1990
Shimoda, M.; Shibamoto, T., Isolation and identification of headspace volatiles from brewed coffee with an on-column GC/MS method, J. Agric. Food Chem., 1990, 38, 3, 802-804, https://doi.org/10.1021/jf00093a045 . [all data]

Ames, Guy, et al., 2001
Ames, J.M.; Guy, R.C.E.; Kipping, G.J., Effect of pH, temperature, and moisture on the formation of volatile compounds in glycine/glucose model systems, J. Agric. Food Chem., 2001, 49, 9, 4315-4323, https://doi.org/10.1021/jf010198m . [all data]

Kim, 2001
Kim, J.S., Einfluss der Temperatur beim Rösten von Sesam auf Aroma und antioxidative Eigenschaften des Öls, PhD Thesis, Technischen Universität Berlin zur Erlangung des akademischen Grades, Berlin, 2001, 151. [all data]

Oh, Hartman, et al., 1992
Oh, Y.-C.; Hartman, T.G.; Ho, C.-T., Volatile compounds generated from the Maillard reaction of pro-gly, gly-pro, and a mixture of glycine and proline with glucose, J. Agric. Food Chem., 1992, 40, 10, 1878-1880, https://doi.org/10.1021/jf00022a030 . [all data]

Lu, Hao, et al., 2005
Lu, C.-Y.; Hao, Z.; Payne, R.; Ho, C.-T., Effects of water content on volatile generation and peptide degradation in the Maillard reaction of glycine, diglycine, and triglycine, J. Agric. Food Chem., 2005, 53, 16, 6443-6447, https://doi.org/10.1021/jf050534p . [all data]

Lopez-Galilea I., Fournier N., et al., 2006
Lopez-Galilea I.; Fournier N.; Cid C.; Guichard E., Changes in headspace volatile concentrations of coffee brews caused by the roasting process and the brewing procedure, J. Agric. Food Chem., 2006, 54, 22, 8560-8566, https://doi.org/10.1021/jf061178t . [all data]

Shiratsuchi, Shimoda, et al., 1994
Shiratsuchi, H.; Shimoda, M.; Imayoshi, K.; Noda, K.; Osajima, Y., Off-flavor compounds in spray-dried skim milk powder, J. Agric. Food Chem., 1994, 42, 6, 1323-1327, https://doi.org/10.1021/jf00042a014 . [all data]

Shiratsuchi, Shimoda, et al., 1994, 2
Shiratsuchi, H.; Shimoda, M.; Imayoshi, K.; Noda, K.; Osajima, Y., Volatile flavor compounds in spray-dried skim milk powder, J. Agric. Food Chem., 1994, 42, 4, 984-988, https://doi.org/10.1021/jf00040a028 . [all data]

Salter L.J., Mottram D.S., et al., 1988
Salter L.J.; Mottram D.S.; Whitfield, Volatile compounds produces in Maillard reactions involving glycine, ribose and phospholid, J. Sci. Food Agric., 1988, 46, 2, 227-242, https://doi.org/10.1002/jsfa.2740460211 . [all data]

Risticevic, Carasek, et al., 2008
Risticevic, S.; Carasek, E.; Pawliszyn, J., Headspace solid-phase microextraction-gas chromatographic-time-of-flight mass spectrometric methodology for geographical origin verification of coffee, Anal. Chim. Acta, 2008, 617, 1-2, 72-84, https://doi.org/10.1016/j.aca.2008.04.009 . [all data]

Leffingwell and Alford, 2005
Leffingwell, J.C.; Alford, E.D., Volatile constituents of Perique tobacco, Electron. J. Environ. Agric. Food Chem., 2005, 4, 2, 899-915. [all data]

Buttery, Ling, et al., 1997
Buttery, R.G.; Ling, L.C.; Stern, D.J., Studies on popcorn aroma and flavor volatiles, J. Agric. Food Chem., 1997, 45, 3, 837-843, https://doi.org/10.1021/jf9604807 . [all data]

Robinson, Adams, et al., 2012
Robinson, A.L.; Adams, D.O.; Boss, P.K.; Heymann, H.; Solomon, P.S.; Trengove, R.D., Influence of geographic origine on the sensory characteristics and wine composition of Vitus viniferas cv. Cabernet Sauvignon wines from Australia (Supplemental data), Am. J. Enol. Vitic., 2012, 64, 4, 467-476, https://doi.org/10.5344/ajev.2012.12023 . [all data]

Cajka, Hajslova, et al., 2007
Cajka, T.; Hajslova, J.; Cochran, J.; Holadova, K.; Klimankova, E., Solid phase microextraction - comprehensive two dimensional gas chromatography - time-of-flight mass spectrometry for the analysis of honey volatiles, J. Sep. Sci., 2007, 30, 4, 534-546, https://doi.org/10.1002/jssc.200600413 . [all data]

Vinogradov, 2004
Vinogradov, B.A., Production, composition, properties and application of essential oils, 2004, retrieved from http://viness.narod.ru. [all data]

Buchbauer, Nikiforov, et al., 1994
Buchbauer, G.; Nikiforov, A.; Remberg, B., Headspace constituents of opium, Planta Medica, 1994, 60, 2, 181-183, https://doi.org/10.1055/s-2006-959447 . [all data]

Puvipirom and Chaisei, 2012
Puvipirom, J.; Chaisei, S., Contribution of roasted grains and seeds in aroma of oleang (Thai coffee drink), Int. Food Res. J., 2012, 19, 2, 583-588. [all data]

Moon and Shibamoto, 2009
Moon, J.-K.; Shibamoto, T., Role of roasting conditions in the profile of volatile flavor chemicals formed from coffee beans, J. Agric. Food Chem., 2009, 57, 13, 5823-5831, https://doi.org/10.1021/jf901136e . [all data]

Ishikawa, Ito, et al., 2004
Ishikawa, M.; Ito, O.; Ishizaki, S.; Kurobayashi, Y.; Fujita, A., Solid-phase aroma concentrate extraction (SPACE ): a new headspace technique for more sensitive analysis of volatiles, Flavour Fragr. J., 2004, 19, 3, 183-187, https://doi.org/10.1002/ffj.1322 . [all data]

Sanz, Maeztu, et al., 2002
Sanz, C.; Maeztu, L.; Zapelena, M.J.; Bello, J.; Cid, C., Profiles of volatile compounds and sensory analysis of three blends of coffee: influence of different proportions of Arabica and Robusta and influence of roasting coffee with sugar, J. Sci. Food Agric., 2002, 82, 8, 840-847, https://doi.org/10.1002/jsfa.1110 . [all data]

Maeztu, Sanz, et al., 2001
Maeztu, L.; Sanz, C.; Andueza, S.; de Peña, M.P.; Bello, J.; Cid, C., Characterization of espresso coffee aroma by static headspace GC-MS and sensory flavor profile, J. Agric. Food Chem., 2001, 49, 11, 5437-5444, https://doi.org/10.1021/jf0107959 . [all data]

Sanz, Ansorena, et al., 2001
Sanz, C.; Ansorena, D.; Bello, J.; Cid, C., Optimizing headspace temperature and time sampling for identification of volatile compounds in ground roasted Arabica coffee, J. Agric. Food Chem., 2001, 49, 3, 1364-1369, https://doi.org/10.1021/jf001100r . [all data]

Kawakami and Kobayashi, 1991
Kawakami, M.; Kobayashi, A., Volatitle constituents of greem mate and roasted mate, J. Agric. Food Chem., 1991, 39, 7, 1275-1279, https://doi.org/10.1021/jf00007a016 . [all data]

Welke, Manfroi, et al., 2012
Welke, J.E.; Manfroi, V.; Zanus, M.; Lazarotto, M.; Zini, C.A., Characterization of the volatile profile of Brazilian merlot wines through comprehensive two dimensional gas chromatography time-of-flight mass spectrometric detection, J. Chromatogr. A, 2012, 1226, 124-139, https://doi.org/10.1016/j.chroma.2012.01.002 . [all data]

Gonzalez-Rios, Suarez-Quiroz, et al., 2007
Gonzalez-Rios, O.; Suarez-Quiroz, M.L.; Boulanger, R.; Barel, M.; Guyot, B.; Guiraud, J.-P.; Schorr-Galindo, S., Impact of ecological post-harvest processing of coffee aroma: II Roasted coffee., J. Food Composition Analysis, 2007, 20, 3-4, 297-307, https://doi.org/10.1016/j.jfca.2006.12.004 . [all data]