(Z)-2-Butenenitrile

Phase change data

Data compiled as indicated in comments:
ALS - Hussein Y. Afeefy, Joel F. Liebman, and Stephen E. Stein
DRB - Donald R. Burgess, Jr.
AC - William E. Acree, Jr., James S. Chickos

Quantity Value Units Method Reference Comment
Δvap38.9kJ/molVKonicek, Prochzka, et al., 1969ALS
Δvap38.9kJ/molN/AKonicek, Prochzka, et al., 1969DRB
Δvap38.9kJ/molN/AKonicek, Prochzka, et al., 1969AC

Enthalpy of vaporization

ΔvapH (kJ/mol) Temperature (K) Method Reference Comment
37.1312.AStephenson and Malanowski, 1987Based on data from 297. - 405. K.; AC
39.0259.N/AStull, 1947Based on data from 244. - 381. K.; AC

Gas phase thermochemistry data

Data compiled by: Hussein Y. Afeefy, Joel F. Liebman, and Stephen E. Stein

Quantity Value Units Method Reference Comment
Δfgas134.0kJ/molCcbKonicek, Prochzka, et al., 1969

References

Konicek, Prochzka, et al., 1969
Konicek, J.; Prochzka, M.; Krestanov, V.; Smisek, M., Thermochemie der nitrile I. Über die bildungswärmen aliphatischer nitrile, Collect. Czech. Chem. Commun., 1969, 34, 2249-2257. [all data]

Stephenson and Malanowski, 1987
Stephenson, Richard M.; Malanowski, Stanislaw, Handbook of the Thermodynamics of Organic Compounds, 1987, https://doi.org/10.1007/978-94-009-3173-2 . [all data]

Stull, 1947
Stull, Daniel R., Vapor Pressure of Pure Substances. Organic and Inorganic Compounds, Ind. Eng. Chem., 1947, 39, 4, 517-540, https://doi.org/10.1021/ie50448a022 . [all data]