Di-isobutyl hydrogen phosphate

Phase change data

Data compiled by: Robert L. Brown and Stephen E. Stein

Quantity Value Units Method Reference Comment
Tboil508. - 509.KN/ABuckingham and Donaghy, 1982

Reduced pressure boiling point

Tboil (K) Pressure (bar) Reference
384. - 386.0.017Buckingham and Donaghy, 1982

References

Buckingham and Donaghy, 1982
Buckingham, J.; Donaghy, S.M., Dictionary of Organic Compounds: Fifth Edition, Chapman and Hall, New York, 1982, 1. [all data]