1,2,3,5-Dithiadiazolyl radical, 4-phenyl-

Gas phase ion energetics data

Data compiled by: Sharon G. Lias and Joel F. Liebman

Ionization energy determinations

IE (eV) Method Reference
7.10PEBoere, Oakley, et al., 1989

References

Boere, Oakley, et al., 1989
Boere, R.T.; Oakley, R.T.; Reed, R.W.; Westwood, N.P.C., Ultraviolet photoelectron and ESR studies of 1,2,4,6-thiatriazinyl and 1,2,3,5-dithiadiazolyl rrdicals, J. Am. Chem. Soc., 1989, 111, 1180. [all data]